##TITLE=nmrdb.org predicted spectrum
##JCAMP-DX=4.24
##DATA TYPE=NMR spectrum
##ORIGIN=
##OWNER=
##XUNITS=PPM
##YUNITS=Intensity
##.OBSERVE NUCLEUS=1H
##.OBSERVE FREQUENCY=400
##.SOLVENT NAME=CDCl3
##NPOINTS=65536
##FIRSTX=0
##LASTX=10
##FIRSTY=0
##LASTY=0
##DELTAX=0.00015259021896696422
##XFACTOR=0.000015259021896696422
##YFACTOR=0.04656612875245797
##XYDATA=(X++(Y..Y))
0@%T4411L7897L5587O6091J20113K13598L71649O32648J053513J716017K733720M258719O486790R658962J4057043
244250D1442347J9990332K7771027L7676734M9900234O4489273Q1282251R9848975J19448179J39014590J57187049
244350H38050991J72385185J82935326J87237725J83957946J72217546J51754891J23027565Q7234080M6243825
244440B145045080K438567m1516266q2940058j19407626j48983985j70391708j83091158j87268565j83741567
244530A030142714j73803492j59034494j41108913j21624399j01970891q3248421o6233918n1390140l8905525
244620I2822521k8752215k0750294j4628814j0077309o784729m465411k873479j808175j112801o69874l94469k27258
$$ plain form
244250 41442347 61432679 89203706 126880440 176780674 241269947 322552198 422401173 541849352 680863942 838050991
244350 838050991 1010436176 1193371502 1380609227 1564567173 1736784719 1888539610 2011567175 2098801255 2145045080
244440 2145045080 2147483647 2105967381 2023027323 1903619697 1754635712 1584244004 1401152846 1213884281 1030142714
244530 1030142714 856339222 697304728 556195815 434571416 332600525 249352104 183118186 131728046 92822521
244620 92822521 64070306 43320012 28691198 18613889 11829160 7363749 4490270 2682095 1569294 899420 504951 277693
244740B77693j28101p0655l8135m0802%S2587Q738Q020J4727K6458M6511P9997J34603K21547L56656N61509Q64412
370760B323178J300985J913945K751679L865176N302948P103835R287931J1846319J4730875J7845844K1043241
370870I9315956K4124064K6846932K8944779L0149071L0219383K8974932K6323497K2283013J6991595J0703279
370970C44876501L768863l396293j0353445j6684936k2035696k6146033k8871537l0188125l0182708k9032117
371070A51754474k6974432k4277491k1209090j8012440j4889036j1989625r412613p208434n387809l931899k802605
$$ plain form
370760 2323178 3624163 5538108 8289787 12154963 17457911 24561746 33849677 45695996 60426871 78272715 99315956
370870 99315956 123440020 150286952 179231731 209380802 239600185 268575117 294898614 317181627 334173222 344876501
370970 344876501 348645364 345249071 334895626 318210690 296174994 270028961 241157424 210969299 180786591 151754474
371070 151754474 124780042 100502551 79293461 61281021 46391985 34402360 24989747 17781313 12393504 8461605 5659000
371180E659000j951724j328253q83578n74633l65420k27254j38231q2247m7874k7265j5192q284r045%S43O771O342
372760A3113J1761K1346L7908O5867J11971J86201L02873M81823P49552J140088J695194K463528L498253M852694
372900A5632172O573773Q693277J1217460J4116038J7312147K0675324K4019673K7109185K9671404L1419497
373000B06439950L2081269L1432073K9327310K5729488K0724993J4526864P461791n7904p574049j4628826k0810950
373110C24652009k5795282k9370665l1452653l2080536l1400351k9637724k7065317k3969942k0623648j7261762
373210E5994129j4069352j1176034q657899o544596m829397l480208k449952j685261j133014p44645m78504l00685
$$ plain form
372760 13113 24874 46220 84128 149995 261966 448167 751040 1232863 1982415 3122503 4817697 7281225 10779478 15632172
372900 15632172 22205945 30899222 42116682 56232720 73544867 94220191 118239864 145349049 175020453 206439950
373000 206439950 238521219 269953292 299280602 325010090 345735083 360261947 367723738 367665834 360091785 345462959 324652009
373110 324652009 298856727 269486062 238033409 205952873 174552522 144914798 117849481 93879539 73255891 55994129
373210 55994129 41924777 30748743 22090844 15546248 10716851 7236643 4786691 3101430 1968416 1223771 745267 444582
373330D44582j84793j11087o5326l7583k1157j1653o281o702%Y237P922P346J3554K4474M3243P4752J26419K09144
445860E06854L38425N35568Q28782J253921J854494K680496L785600N222298P034819R249933J1866300J4843526
445980F0001016J8092638K1470091K4777449K7768600L0165436L1681753L2053497L1072012K8615717K4675164
446080C30373373J9366794J2932080N720835j839944r287909j6172161k2098441k6766390k9994044l1726834
446180B30507359l2031083l1074236k9095977k6375155k3197498j9828107j6491406j3359621j0549406q125166
446280B0379704o107041m481360l211630k248591j538429j028786o72570m29921k68747j64309r8263n7488l2905
$$ plain form
445860 506854 845279 1380847 2209629 3463550 5318044 7998540 11784140 17006438 24041257 33291190 45157490 60001016
445980 60001016 78093654 99563745 124341194 152109794 182275230 213956983 246010480 277082492 305698209 330373373
446080 330373373 349740167 362672247 368393082 366553138 357265229 341093068 318994627 292228237 262234193 230507359
446180 230507359 198476276 167402040 138306063 111930908 88733410 68905303 52413897 39054276 28504870 20379704
446280 20379704 14272663 9791303 6579673 4331082 2792653 1763867 1091297 661376 392629 228320 130057 72569 39664
446410C9664j8428j0099n415n722%S42N479N183R660J7620L1449N4922R3840J56849K56440M10064O41240R80454
447990B663200J465537K141140L056848M263531N807631P723354J0023130J2687226J5653871J8811780K1997104
448100A06294352K4996757K7559461K9414855L0299615K9988044K8323323K5244707K0806019J5181554Q657271
448200C46765958J607385n541062j2351024j8419684k3417871k7119304k9416098l0319312k9945694k8493839
448300A43349455k6214143k3377392k0246228j7052688j3983520j1173505q705874o618057m910736l558193k518389
$$ plain form
447990 2663200 4128737 6269877 9326725 13590256 19397887 27121241 37144371 49831597 65485468 84297248 106294352
448100 106294352 131291109 158850570 188265425 218565040 248553084 276876407 302121114 322927133 338108687 346765958
448200 346765958 348373343 342832281 330481257 312061573 288643702 261524398 232108300 201788988 171843294 143349455
448300 143349455 117135312 93757920 73511692 56459004 42475484 31301979 22596105 15978048 11067312 7509119 4990730
448410D990730j741597j177087p77673n02332l17291j96003j18429o9998m0476k2899j2677o867p401%T0681
655350@
##END=